rowid,country,country_long,name,gppd_idnr,capacity_mw,latitude,longitude,primary_fuel,other_fuel1,other_fuel2,other_fuel3,commissioning_year,owner,source,url,geolocation_source,wepp_id,year_of_capacity_data,generation_gwh_2013,generation_gwh_2014,generation_gwh_2015,generation_gwh_2016,generation_gwh_2017,generation_gwh_2018,generation_gwh_2019,generation_data_source,estimated_generation_gwh_2013,estimated_generation_gwh_2014,estimated_generation_gwh_2015,estimated_generation_gwh_2016,estimated_generation_gwh_2017,estimated_generation_note_2013,estimated_generation_note_2014,estimated_generation_note_2015,estimated_generation_note_2016,estimated_generation_note_2017
23745,GBR,United Kingdom,Nant y Caws Landfill Site,GBR0000607,1.4,51.8369,-4.2192,Waste,,,,,NOVERA,UK Renewable Energy Planning Database,https://www.gov.uk/government/collections/renewable-energy-planning-data,UK Renewable Energy Planning Database,,,,,,,,,,,,,,,1.35,NO-ESTIMATION,NO-ESTIMATION,NO-ESTIMATION,NO-ESTIMATION,CAPACITY-FACTOR-V1
22939,GBR,United Kingdom,Glapwell Power,GBR0000541,2.0,53.1963,-1.3099,Waste,,,,,NOVERA,UK Renewable Energy Planning Database,https://www.gov.uk/government/collections/renewable-energy-planning-data,UK Renewable Energy Planning Database,,,,,,,,,,,,,,,1.93,NO-ESTIMATION,NO-ESTIMATION,NO-ESTIMATION,NO-ESTIMATION,CAPACITY-FACTOR-V1
22692,GBR,United Kingdom,Dimmer Landfill Gas Scheme,GBR0000592,2.3,51.0761,-2.5538,Waste,,,,,NOVERA,UK Renewable Energy Planning Database,https://www.gov.uk/government/collections/renewable-energy-planning-data,UK Renewable Energy Planning Database,1047400,,,,,,,,,,,,,,2.22,NO-ESTIMATION,NO-ESTIMATION,NO-ESTIMATION,NO-ESTIMATION,CAPACITY-FACTOR-V1
22329,GBR,United Kingdom,Brynpica Landfill Site,GBR0000665,2.7,51.6579,-3.4832,Waste,,,,,NOVERA,UK Renewable Energy Planning Database,https://www.gov.uk/government/collections/renewable-energy-planning-data,UK Renewable Energy Planning Database,,,,,,,,,,,,,,,2.61,NO-ESTIMATION,NO-ESTIMATION,NO-ESTIMATION,NO-ESTIMATION,CAPACITY-FACTOR-V1
24201,GBR,United Kingdom,Silent Valley Landfill Scheme,GBR0000601,2.7,51.7557,-3.1821,Waste,,,,,NOVERA,UK Renewable Energy Planning Database,https://www.gov.uk/government/collections/renewable-energy-planning-data,UK Renewable Energy Planning Database,1062355,,,,,,,,,,,,,,2.61,NO-ESTIMATION,NO-ESTIMATION,NO-ESTIMATION,NO-ESTIMATION,CAPACITY-FACTOR-V1
22795,GBR,United Kingdom,Enderby Warren Phase II,GBR0000539,4.9,52.597,-1.2101,Waste,,,,,NOVERA,UK Renewable Energy Planning Database,https://www.gov.uk/government/collections/renewable-energy-planning-data,UK Renewable Energy Planning Database,,,,,,,,,,,,,,,4.74,NO-ESTIMATION,NO-ESTIMATION,NO-ESTIMATION,NO-ESTIMATION,CAPACITY-FACTOR-V1
22043,GBR,United Kingdom,Arpley Landfill Scheme 'A',GBR0000547,7.9,53.3718,-2.6432,Waste,,,,,NOVERA,UK Renewable Energy Planning Database,https://www.gov.uk/government/collections/renewable-energy-planning-data,UK Renewable Energy Planning Database,1053941,,,,,,,,,,,,,,7.65,NO-ESTIMATION,NO-ESTIMATION,NO-ESTIMATION,NO-ESTIMATION,CAPACITY-FACTOR-V1
22044,GBR,United Kingdom,Arpley Landfill Scheme 'B',GBR0000549,7.9,53.3718,-2.6432,Waste,,,,,NOVERA,UK Renewable Energy Planning Database,https://www.gov.uk/government/collections/renewable-energy-planning-data,UK Renewable Energy Planning Database,1053941,,,,,,,,,,,,,,7.65,NO-ESTIMATION,NO-ESTIMATION,NO-ESTIMATION,NO-ESTIMATION,CAPACITY-FACTOR-V1
